Target
D(1A) dopamine receptor
Ligand
BDBM50122813
Substrate
Meas. Tech.
ChEMBL_58505 (CHEMBL672000)
Ki
2600±n/a nM
Citation
 Balle, TPerregaard, JRamirez, MTLarsen, AKSøby, KKLiljefors, TAndersen, K Synthesis and structure-affinity relationship investigations of 5-heteroaryl-substituted analogues of the antipsychotic sertindole. A new class of highly selective alpha(1) adrenoceptor antagonists. J Med Chem 46:265-83 (2003)  
Target
Name:
D(1A) dopamine receptor
Synonyms:
DOPAMINE D1 Dopamine D1 high Dopamine receptor Dopamine1-like Drd1a
Type:
Enzyme Catalytic Domain
Mol. Mass.:
49429.75
Organism:
RAT
Description:
P18901
Residue:
446
  
Inhibitor
Name:
BDBM50122813
Synonyms:
3-(2-{4-[1-(4-Fluoro-phenyl)-5-(2-methyl-2H-tetrazol-5-yl)-1H-indol-3-yl]-piperidin-1-yl}-ethyl)-oxazolidin-2-one | CHEMBL97242
Type:
Small organic molecule
Emp. Form.:
C26H28FN7O2
Mol. Mass.:
489.5446
SMILES:
Cn1nnc(n1)-c1ccc2n(cc(C3CCN(CCN4CCOC4=O)CC3)c2c1)-c1ccc(F)cc1
: