Target
Alpha-1A adrenergic receptor
Ligand
BDBM50122817
Substrate
Meas. Tech.
ChEMBL_33584 (CHEMBL647135)
Ki
1.3±n/a nM
Citation
 Balle, TPerregaard, JRamirez, MTLarsen, AKSøby, KKLiljefors, TAndersen, K Synthesis and structure-affinity relationship investigations of 5-heteroaryl-substituted analogues of the antipsychotic sertindole. A new class of highly selective alpha(1) adrenoceptor antagonists. J Med Chem 46:265-83 (2003)  
Target
Name:
Alpha-1A adrenergic receptor
Synonyms:
ADA1A_BOVIN ADRA1C Alpha 1A-adrenoreceptor Cerebral cortex alpha adrenergic receptor | adrenergic Alpha1
Type:
Enzyme Catalytic Domain
Mol. Mass.:
51492.08
Organism:
CALF
Description:
adrenergic Alpha1 0 CALF
Residue:
466
  
Inhibitor
Name:
BDBM50122817
Synonyms:
3-(2-{4-[1-(4-Fluoro-phenyl)-5-(1-methyl-1H-[1,2,4]triazol-3-yl)-1H-indol-3-yl]-piperidin-1-yl}-ethyl)-1H-quinazoline-2,4-dione | CHEMBL318901
Type:
Small organic molecule
Emp. Form.:
C32H30FN7O2
Mol. Mass.:
563.6247
SMILES:
Cn1cnc(n1)-c1ccc2n(cc(C3CCN(CCn4c(=O)[nH]c5ccccc5c4=O)CC3)c2c1)-c1ccc(F)cc1
: