Target
D(3) dopamine receptor
Ligand
BDBM50122817
Substrate
Meas. Tech.
ChEMBL_62107 (CHEMBL674985)
Ki
590±n/a nM
Citation
 Balle, TPerregaard, JRamirez, MTLarsen, AKSøby, KKLiljefors, TAndersen, K Synthesis and structure-affinity relationship investigations of 5-heteroaryl-substituted analogues of the antipsychotic sertindole. A new class of highly selective alpha(1) adrenoceptor antagonists. J Med Chem 46:265-83 (2003)  
Target
Name:
D(3) dopamine receptor
Synonyms:
DOPAMINE D3 DRD3_HUMAN Dopamine D3 receptor (D3) Dopamine receptor Dopamine receptor D3
Type:
Mol. Mass.:
44243.43
Organism:
Homo sapiens (Human)
Description:
Residue:
400
  
Inhibitor
Name:
BDBM50122817
Synonyms:
3-(2-{4-[1-(4-Fluoro-phenyl)-5-(1-methyl-1H-[1,2,4]triazol-3-yl)-1H-indol-3-yl]-piperidin-1-yl}-ethyl)-1H-quinazoline-2,4-dione | CHEMBL318901
Type:
Small organic molecule
Emp. Form.:
C32H30FN7O2
Mol. Mass.:
563.6247
SMILES:
Cn1cnc(n1)-c1ccc2n(cc(C3CCN(CCn4c(=O)[nH]c5ccccc5c4=O)CC3)c2c1)-c1ccc(F)cc1
: