Target
Alpha-1B adrenergic receptor
Ligand
BDBM50122799
Substrate
Meas. Tech.
ChEMBL_34197 (CHEMBL649214)
Ki
4±n/a nM
Citation
 Balle, TPerregaard, JRamirez, MTLarsen, AKSøby, KKLiljefors, TAndersen, K Synthesis and structure-affinity relationship investigations of 5-heteroaryl-substituted analogues of the antipsychotic sertindole. A new class of highly selective alpha(1) adrenoceptor antagonists. J Med Chem 46:265-83 (2003)  
Target
Name:
Alpha-1B adrenergic receptor
Synonyms:
ADA1B_MESAU Adrenergic receptor alpha adrenergic Alpha1B
Type:
Enzyme Catalytic Domain
Mol. Mass.:
56514.13
Organism:
C.H.O.
Description:
adrenergic Alpha1B ADRA1B C.H.O.::P18841
Residue:
515
  
Inhibitor
Name:
BDBM50122799
Synonyms:
1-(2-{4-[1-(4-Fluoro-phenyl)-5-(1-methyl-1H-pyrazol-3-yl)-1H-indol-3-yl]-piperidin-1-yl}-ethyl)-imidazolidin-2-one | CHEMBL93923
Type:
Small organic molecule
Emp. Form.:
C28H31FN6O
Mol. Mass.:
486.5837
SMILES:
Cn1ccc(n1)-c1ccc2n(cc(C3CCN(CCN4CCNC4=O)CC3)c2c1)-c1ccc(F)cc1
: