Target
5-hydroxytryptamine receptor 1B
Ligand
BDBM50122819
Substrate
Meas. Tech.
ChEMBL_1336 (CHEMBL616962)
Ki
4.2±n/a nM
Citation
 Balle, TPerregaard, JRamirez, MTLarsen, AKSøby, KKLiljefors, TAndersen, K Synthesis and structure-affinity relationship investigations of 5-heteroaryl-substituted analogues of the antipsychotic sertindole. A new class of highly selective alpha(1) adrenoceptor antagonists. J Med Chem 46:265-83 (2003)  
Target
Name:
5-hydroxytryptamine receptor 1B
Synonyms:
5-HT-1B 5-HT1B 5HT1B_HUMAN HTR1DB Serotonin (5-HT) receptor Serotonin Receptor 1B
Type:
G Protein-Coupled Receptor (GPCR)
Mol. Mass.:
43579.17
Organism:
Homo sapiens (Human)
Description:
Receptor binding assays were performed using human clone stably expressed in CHO cells
Residue:
390
  
Inhibitor
Name:
BDBM50122819
Synonyms:
1-(2-{4-[1-(4-Fluoro-phenyl)-5-pyrimidin-5-yl-1H-indol-3-yl]-piperidin-1-yl}-ethyl)-imidazolidin-2-one | CHEMBL97650
Type:
Small organic molecule
Emp. Form.:
C28H29FN6O
Mol. Mass.:
484.5679
SMILES:
Fc1ccc(cc1)-n1cc(C2CCN(CCN3CCNC3=O)CC2)c2cc(ccc12)-c1cncnc1
: