Target
D(4) dopamine receptor
Ligand
BDBM50122808
Substrate
Meas. Tech.
ChEMBL_63101 (CHEMBL674494)
Ki
7500±n/a nM
Citation
 Balle, TPerregaard, JRamirez, MTLarsen, AKSøby, KKLiljefors, TAndersen, K Synthesis and structure-affinity relationship investigations of 5-heteroaryl-substituted analogues of the antipsychotic sertindole. A new class of highly selective alpha(1) adrenoceptor antagonists. J Med Chem 46:265-83 (2003)  
Target
Name:
D(4) dopamine receptor
Synonyms:
D(2C) dopamine receptor DOPAMINE D4.2 DRD4 Dopamine D4 receptor
Type:
Enzyme
Mol. Mass.:
48373.19
Organism:
Homo sapiens (Human)
Description:
P21917
Residue:
419
  
Inhibitor
Name:
BDBM50122808
Synonyms:
3-(2-{4-[1-(4-Fluoro-phenyl)-5-pyrimidin-2-yl-1H-indol-3-yl]-piperidin-1-yl}-ethyl)-oxazolidin-2-one | CHEMBL95175
Type:
Small organic molecule
Emp. Form.:
C28H28FN5O2
Mol. Mass.:
485.5526
SMILES:
Fc1ccc(cc1)-n1cc(C2CCN(CCN3CCOC3=O)CC2)c2cc(ccc12)-c1ncccn1
: