Target
Alpha-1B adrenergic receptor
Ligand
BDBM50122806
Substrate
Meas. Tech.
ChEMBL_34197 (CHEMBL649214)
Ki
4.6±n/a nM
Citation
 Balle, TPerregaard, JRamirez, MTLarsen, AKSøby, KKLiljefors, TAndersen, K Synthesis and structure-affinity relationship investigations of 5-heteroaryl-substituted analogues of the antipsychotic sertindole. A new class of highly selective alpha(1) adrenoceptor antagonists. J Med Chem 46:265-83 (2003)  
Target
Name:
Alpha-1B adrenergic receptor
Synonyms:
ADA1B_MESAU Adrenergic receptor alpha adrenergic Alpha1B
Type:
Enzyme Catalytic Domain
Mol. Mass.:
56514.13
Organism:
C.H.O.
Description:
adrenergic Alpha1B ADRA1B C.H.O.::P18841
Residue:
515
  
Inhibitor
Name:
BDBM50122806
Synonyms:
3-{4-[1-(4-Fluoro-phenyl)-5-pyrimidin-2-yl-1H-indol-3-yl]-piperidin-1-yl}-propionitrile | CHEMBL317333
Type:
Small organic molecule
Emp. Form.:
C26H24FN5
Mol. Mass.:
425.5007
SMILES:
Fc1ccc(cc1)-n1cc(C2CCN(CCC#N)CC2)c2cc(ccc12)-c1ncccn1
: