Target
Alpha-1A adrenergic receptor
Ligand
BDBM50122813
Substrate
Meas. Tech.
ChEMBL_33584 (CHEMBL647135)
Ki
0.35±n/a nM
Citation
 Balle, TPerregaard, JRamirez, MTLarsen, AKSøby, KKLiljefors, TAndersen, K Synthesis and structure-affinity relationship investigations of 5-heteroaryl-substituted analogues of the antipsychotic sertindole. A new class of highly selective alpha(1) adrenoceptor antagonists. J Med Chem 46:265-83 (2003)  
Target
Name:
Alpha-1A adrenergic receptor
Synonyms:
ADA1A_BOVIN ADRA1C Alpha 1A-adrenoreceptor Cerebral cortex alpha adrenergic receptor | adrenergic Alpha1
Type:
Enzyme Catalytic Domain
Mol. Mass.:
51492.08
Organism:
CALF
Description:
adrenergic Alpha1 0 CALF
Residue:
466
  
Inhibitor
Name:
BDBM50122813
Synonyms:
3-(2-{4-[1-(4-Fluoro-phenyl)-5-(2-methyl-2H-tetrazol-5-yl)-1H-indol-3-yl]-piperidin-1-yl}-ethyl)-oxazolidin-2-one | CHEMBL97242
Type:
Small organic molecule
Emp. Form.:
C26H28FN7O2
Mol. Mass.:
489.5446
SMILES:
Cn1nnc(n1)-c1ccc2n(cc(C3CCN(CCN4CCOC4=O)CC3)c2c1)-c1ccc(F)cc1
: