Target
Delta-type opioid receptor
Ligand
BDBM50133264
Substrate
Meas. Tech.
ChEMBL_145057 (CHEMBL753991)
IC50
210±n/a nM
Citation
 Hruby, VJ Peptide science: exploring the use of chemical principles and interdisciplinary collaboration for understanding life processes. J Med Chem 46:4215-31 (2003)  
Target
Name:
Delta-type opioid receptor
Synonyms:
Cytochrome P450 3A4 Delta opioid receptor Delta-type opioid receptor (DOR) OPRD_RAT Opioid receptor Opioid receptors; mu & delta Ror-a | Voltage-gated potassium channel
Type:
G Protein-Coupled Receptor (GPCR)
Mol. Mass.:
40465.04
Organism:
Rattus norvegicus (rat)
Description:
Competition binding assays were using CHO-K1 cell membranes expressing the opioid receptor.
Residue:
372
  
Inhibitor
Name:
BDBM50133264
Synonyms:
CHEMBL133719 | [(2S,3S)-TMT1]DPDPE
Type:
Small organic molecule
Emp. Form.:
C33H47N5O7S2
Mol. Mass.:
689.886
SMILES:
C[C@H]([C@H](N)C(=O)N[C@H](C(=O)NCC(=O)N[C@@H](Cc1ccccc1)C(=O)N[C@H](C(O)=O)C(C)(C)S)C(C)(C)S)c1c(C)cc(O)cc1C
: