Target
Gastrin/cholecystokinin type B receptor
Ligand
BDBM50133265
Substrate
Meas. Tech.
ChEMBL_48762 (CHEMBL666788)
Ki
2.1±n/a nM
Citation
 Hruby, VJ Peptide science: exploring the use of chemical principles and interdisciplinary collaboration for understanding life processes. J Med Chem 46:4215-31 (2003)  
Target
Name:
Gastrin/cholecystokinin type B receptor
Synonyms:
CCK-2 receptor CCK-BR CCKRB Cholecystokinin receptor GASR_HUMAN | Gastrin/cholecystokinin type B receptor
Type:
G Protein-Coupled Receptor (GPCR)
Mol. Mass.:
48445.79
Organism:
Homo sapiens (Human)
Description:
Stable expression of human CCK-2 receptors in HEK 293 cells.
Residue:
447
  
Inhibitor
Name:
BDBM50133265
Synonyms:
CHEMBL411201 | H-Tyr-D-Phe-Glu-Trp-N-MeNle-Asp-Phe-NH2
Type:
Small organic molecule
Emp. Form.:
C54H65N9O12
Mol. Mass.:
1032.147
SMILES:
CCCC[C@H](N(C)C(=O)[C@H](Cc1c[nH]c2ccccc12)NC(=O)[C@H](CCC(O)=O)NC(=O)[C@H](Cc1ccccc1)NC(=O)[C@@H](N)Cc1ccc(O)cc1)C(=O)N[C@@H](CC(O)=O)C(=O)N[C@@H](Cc1ccccc1)C(N)=O
: