Target
Purine nucleoside phosphorylase
Ligand
BDBM22109
Substrate
Meas. Tech.
ChEMBL_162007 (CHEMBL764178)
Ki
0.016±n/a nM
Citation
 Evans, GBFurneaux, RHLewandowicz, ASchramm, VLTyler, PC Synthesis of second-generation transition state analogues of human purine nucleoside phosphorylase. J Med Chem 46:5271-6 (2003)  
Target
Name:
Purine nucleoside phosphorylase
Synonyms:
Inosine phosphorylase NP PNPH_HUMAN | Purine nucleoside phosphorylase (PNPase)
Type:
Enzyme
Mol. Mass.:
32119.53
Organism:
Homo sapiens (Human)
Description:
Residue:
289
  
Inhibitor
Name:
BDBM22109
Synonyms:
7-{[(3R,4R)-3-hydroxy-4-(hydroxymethyl)pyrrolidin-1-yl]methyl}-1,5-dihydro-4H-pyrrolo[3,2-d]pyrimidin-4-one CHEMBL1213653 DADMe-ImmH,7
Type:
Emp. Form.:
C12H16N4O3
Mol. Mass.:
264.2804
SMILES:
OC[C@H]1CN(Cc2c[nH]c3c2nc[nH]c3=O)C[C@@H]1O
: