Target
Prothrombin
Ligand
BDBM50135943
Substrate
Meas. Tech.
ChEMBL_208539 (CHEMBL813633)
Ki
6500±n/a nM
Citation
 Pruitt, JRPinto, DJGalemmo, RAAlexander, RSRossi, KAWells, BLDrummond, SBostrom, LLBurdick, DBruckner, RChen, HSmallwood, AWong, PCWright, MRBai, SLuettgen, JMKnabb, RMLam, PYWexler, RR Discovery of 1-(2-aminomethylphenyl)-3-trifluoromethyl-N- [3-fluoro-2'-(aminosulfonyl)[1,1'-biphenyl)]-4-yl]-1H-pyrazole-5-carboxyamide (DPC602), a potent, selective, and orally bioavailable factor Xa inhibitor(1). J Med Chem 46:5298-315 (2003)  
Target
Name:
Prothrombin
Synonyms:
Activation peptide fragment 1 Coagulation factor II Prothrombin precursor Thrombin heavy chain | Thrombin light chain
Type:
Protein
Mol. Mass.:
70029.57
Organism:
Homo sapiens (Human)
Description:
P00734
Residue:
622
  
Inhibitor
Name:
BDBM50135943
Synonyms:
2-(2-Aminomethyl-4-methoxy-phenyl)-5-trifluoromethyl-2H-pyrazole-3-carboxylic acid (3-fluoro-2'-methanesulfonyl-biphenyl-4-yl)-amide | CHEMBL148718
Type:
Small organic molecule
Emp. Form.:
C26H22F4N4O4S
Mol. Mass.:
562.536
SMILES:
COc1ccc(c(CN)c1)-n1nc(cc1C(=O)Nc1ccc(cc1F)-c1ccccc1S(C)(=O)=O)C(F)(F)F
: