Target
Coagulation factor X
Ligand
BDBM50135953
Substrate
Meas. Tech.
ChEMBL_48954 (CHEMBL661667)
Ki
4.3±n/a nM
Citation
 Pruitt, JRPinto, DJGalemmo, RAAlexander, RSRossi, KAWells, BLDrummond, SBostrom, LLBurdick, DBruckner, RChen, HSmallwood, AWong, PCWright, MRBai, SLuettgen, JMKnabb, RMLam, PYWexler, RR Discovery of 1-(2-aminomethylphenyl)-3-trifluoromethyl-N- [3-fluoro-2'-(aminosulfonyl)[1,1'-biphenyl)]-4-yl]-1H-pyrazole-5-carboxyamide (DPC602), a potent, selective, and orally bioavailable factor Xa inhibitor(1). J Med Chem 46:5298-315 (2003)  
Target
Name:
Coagulation factor X
Synonyms:
Activated coagulation factor X (FXa) Coagulation factor X precursor F10 Factor X heavy chain Factor Xa Stuart-Prower factor
Type:
Enzyme
Mol. Mass.:
54726.60
Organism:
Homo sapiens (Human)
Description:
Residue:
488
  
Inhibitor
Name:
BDBM50135953
Synonyms:
2-(2-Aminomethyl-phenyl)-5-trifluoromethyl-2H-pyrazole-3-carboxylic acid (3-fluoro-2'-methanesulfonyl-biphenyl-4-yl)-amide | CHEMBL146910
Type:
Small organic molecule
Emp. Form.:
C25H20F4N4O3S
Mol. Mass.:
532.51
SMILES:
CS(=O)(=O)c1ccccc1-c1ccc(NC(=O)c2cc(nn2-c2ccccc2CN)C(F)(F)F)c(F)c1
: