Target
Serine protease 1
Ligand
BDBM50135965
Substrate
Meas. Tech.
ChEMBL_212876 (CHEMBL817826)
Ki
>1500±n/a nM
Citation
 Pruitt, JRPinto, DJGalemmo, RAAlexander, RSRossi, KAWells, BLDrummond, SBostrom, LLBurdick, DBruckner, RChen, HSmallwood, AWong, PCWright, MRBai, SLuettgen, JMKnabb, RMLam, PYWexler, RR Discovery of 1-(2-aminomethylphenyl)-3-trifluoromethyl-N- [3-fluoro-2'-(aminosulfonyl)[1,1'-biphenyl)]-4-yl]-1H-pyrazole-5-carboxyamide (DPC602), a potent, selective, and orally bioavailable factor Xa inhibitor(1). J Med Chem 46:5298-315 (2003)  
Target
Name:
Serine protease 1
Synonyms:
Alpha-trypsin chain 1 Beta-trypsin PRSS1 TRP1 TRY1_HUMAN Thrombin & trypsin Trypsin I | Trypsin-1
Type:
Enzyme
Mol. Mass.:
26557.80
Organism:
Homo sapiens (Human)
Description:
P07477
Residue:
247
  
Inhibitor
Name:
BDBM50135965
Synonyms:
2-(4-Methoxy-phenyl)-5-methyl-2H-pyrazole-3-carboxylic acid (3-fluoro-2'-sulfamoyl-biphenyl-4-yl)-amide | CHEMBL147132
Type:
Small organic molecule
Emp. Form.:
C24H21FN4O4S
Mol. Mass.:
480.511
SMILES:
COc1ccc(cc1)-n1nc(C)cc1C(=O)Nc1ccc(cc1F)-c1ccccc1S(N)(=O)=O
: