Target
Prothrombin
Ligand
BDBM18974
Substrate
Meas. Tech.
ChEMBL_208539 (CHEMBL813633)
Ki
>21000±n/a nM
Citation
 Pruitt, JRPinto, DJGalemmo, RAAlexander, RSRossi, KAWells, BLDrummond, SBostrom, LLBurdick, DBruckner, RChen, HSmallwood, AWong, PCWright, MRBai, SLuettgen, JMKnabb, RMLam, PYWexler, RR Discovery of 1-(2-aminomethylphenyl)-3-trifluoromethyl-N- [3-fluoro-2'-(aminosulfonyl)[1,1'-biphenyl)]-4-yl]-1H-pyrazole-5-carboxyamide (DPC602), a potent, selective, and orally bioavailable factor Xa inhibitor(1). J Med Chem 46:5298-315 (2003)  
Target
Name:
Prothrombin
Synonyms:
Activation peptide fragment 1 Coagulation factor II Prothrombin precursor Thrombin heavy chain | Thrombin light chain
Type:
Protein
Mol. Mass.:
70029.57
Organism:
Homo sapiens (Human)
Description:
P00734
Residue:
622
  
Inhibitor
Name:
BDBM18974
Synonyms:
3-methyl-1-phenyl-N-[4-(2-sulfamoylphenyl)phenyl]-1H-pyrazole-5-carboxamide pyrazole-based inhibitor, 22d
Type:
Small organic molecule
Emp. Form.:
C23H20N4O3S
Mol. Mass.:
432.495
SMILES:
Cc1cc(C(=O)Nc2ccc(cc2)-c2ccccc2S(N)(=O)=O)n(n1)-c1ccccc1
: