Target
Sodium-dependent serotonin transporter
Ligand
BDBM82071
Substrate
Meas. Tech.
ChEMBL_201814 (CHEMBL805322)
Ki
52±n/a nM
Citation
 Orjales, AMosquera, RToledo, APumar, MCGarcía, NCortizo, LLabeaga, LInnerárity, A Syntheses and binding studies of new [(aryl)(aryloxy)methyl]piperidine derivatives and related compounds as potential antidepressant drugs with high affinity for serotonin (5-HT) and norepinephrine (NE) transporters. J Med Chem 46:5512-32 (2003)  
Target
Name:
Sodium-dependent serotonin transporter
Synonyms:
5-HT Transporter 5HT transporter Anandamid membrane transporter, AMT Monoamine transporters; Norepinephrine & serotonin Slc6a4 Sodium-dependent serotonin transporter (SERT) | imipramine receptor
Type:
Multi-pass membrane protein
Mol. Mass.:
70168.43
Organism:
Rattus norvegicus (rat)
Description:
P31652
Residue:
630
  
Inhibitor
Name:
BDBM82071
Synonyms:
CAS_93413-69-5 NSC_62923 Venlafaxine hydrochloride WY-45655
Type:
Small organic molecule
Emp. Form.:
C17H27NO2
Mol. Mass.:
277.4018
SMILES:
COc1ccc(cc1)C(CN(C)C)C1(O)CCCCC1
: