Target
Somatostatin receptor type 4
Ligand
BDBM50136764
Substrate
Meas. Tech.
ChEMBL_200834 (CHEMBL807045)
IC50
>1000±n/a nM
Citation
 Rivier, JErchegyi, JHoeger, CMiller, CLow, WWenger, SWaser, BSchaer, JCReubi, JC Novel sst(4)-selective somatostatin (SRIF) agonists. 1. Lead identification using a betide scan. J Med Chem 46:5579-86 (2003)  
Target
Name:
Somatostatin receptor type 4
Synonyms:
SOMATOSTATIN SST4 SS4-R SSR4_HUMAN SSTR4 | Somatostatin receptor type 4 (SSTR4)
Type:
Enzyme
Mol. Mass.:
42015.38
Organism:
Homo sapiens (Human)
Description:
P31391
Residue:
388
  
Inhibitor
Name:
BDBM50136764
Synonyms:
(11S,29S)-29-Amino-7-(S)-1-benzyl-23,26-dibenzyl-4-carboxy-10-((S)-1-hydroxy-ethyl)-20-(1H-indol-3-ylmethyl)-13-methyl-6,12,15,28-tetraoxo-9,19,25-tri(R)-oxo-22-(S)-oxo-1,2-dithia-5,8,11,14,16,18,21,24,27-nonaaza-cyclotriacontan-17-ol anion sst4-selective analogue 17
Type:
Small organic molecule
Emp. Form.:
C53H62N11O12S2
Mol. Mass.:
1109.256
SMILES:
C[C@@H](O)[C@@H]1NC(=O)[C@H](C)NC(=O)N[C@H]([O-])NC(=O)[C@@H](Cc2c[nH]c3ccccc23)NC(=O)[C@H](Cc2ccccc2)NC(=O)[C@@H](Cc2ccccc2)NC(=O)[C@H](N)CSSC[C@@H](NC(=O)[C@H](Cc2ccccc2)NC1=O)C(O)=O
: