Target
Somatostatin receptor type 2
Ligand
BDBM50136773
Substrate
Meas. Tech.
ChEMBL_200673 (CHEMBL806164)
IC50
22±n/a nM
Citation
 Erchegyi, JPenke, BSimon, LMichaelson, SWenger, SWaser, BCescato, RSchaer, JCReubi, JCRivier, J Novel sst(4)-selective somatostatin (SRIF) agonists. 2. Analogues with beta-methyl-3-(2-naphthyl)alanine substitutions at position 8. J Med Chem 46:5587-96 (2003)  
Target
Name:
Somatostatin receptor type 2
Synonyms:
SOMATOSTATIN SST2 SS-2-R SS2R SSTR2 | Somatostatin receptor type 2 (SSTR2)
Type:
Enzyme
Mol. Mass.:
41344.94
Organism:
Homo sapiens (Human)
Description:
P30874
Residue:
369
  
Inhibitor
Name:
BDBM50136773
Synonyms:
6-amino-18-(4-aminobutyl)-9,24-dibenzyl-21-(1-hydroxyethyl)-12-(4-iodobenzyl)-15-[1-(2-naphthyl)ethyl]-7,10,13,16,19,22,25-heptaoxo-3,4-dithia-8,11,14,17,20,23,26-heptaazacyclohexacosane-1-carboxylic acid | CHEMBL414446
Type:
Small organic molecule
Emp. Form.:
C57H68IN9O10S2
Mol. Mass.:
1230.239
SMILES:
C[C@@H](O)[C@H]1NC(=O)[C@H](CCCCN)NC(=O)[C@@H](NC(=O)[C@H](Cc2ccc(I)cc2)NC(=O)[C@@H](Cc2ccccc2)NC(=O)[C@H](N)CSSC[C@H](NC(=O)[C@H](Cc2ccccc2)NC1=O)C(O)=O)[C@H](C)c1ccc2ccccc2c1
: