Target
Solute carrier family 15 member 1
Ligand
BDBM50136994
Substrate
Meas. Tech.
ChEMBL_89213 (CHEMBL699705)
Ki
70000±n/a nM
Citation
 Gebauer, SKnütter, IHartrodt, BBrandsch, MNeubert, KThondorf, I Three-dimensional quantitative structure-activity relationship analyses of peptide substrates of the mammalian H+/peptide cotransporter PEPT1. J Med Chem 46:5725-34 (2003)  
Target
Name:
Solute carrier family 15 member 1
Synonyms:
Intestinal H(+)/peptide cotransporter Oligopeptide transporter, small intestine isoform Peptide transporter 1 SLC15A1
Type:
PROTEIN
Mol. Mass.:
78818.07
Organism:
Homo sapiens (Human)
Description:
ChEMBL_1488839
Residue:
708
  
Inhibitor
Name:
BDBM50136994
Synonyms:
2-[(2-ammoniopropanoyl)amino]butanoate | CHEMBL152224
Type:
Small organic molecule
Emp. Form.:
C7H14N2O3
Mol. Mass.:
174.1977
SMILES:
CCC(NC(=O)C(C)[NH3+])C([O-])=O
: