Target
Delta-type opioid receptor
Ligand
BDBM50123658
Substrate
Meas. Tech.
ChEMBL_146914 (CHEMBL757502)
Ki
0.18±n/a nM
Citation
 Bishop, MJGarrido, DMBoswell, GECollins, MAHarris, PAMcNutt, RWO'Neill, SJWei, KChang, KJ 3-(alphaR)-alpha-((2S,5R)-4-allyl-2,5-dimethyl-1-piperazinyl)-3-hydroxybenzyl)-N-alkyl-N-arylbenzamides: potent, non-peptidic agonists of both the micro and delta opioid receptors. J Med Chem 46:623-33 (2003)  
Target
Name:
Delta-type opioid receptor
Synonyms:
Cytochrome P450 3A4 Delta opioid receptor Delta-type opioid receptor (DOR) OPRD_RAT Opioid receptor Opioid receptors; mu & delta Ror-a | Voltage-gated potassium channel
Type:
G Protein-Coupled Receptor (GPCR)
Mol. Mass.:
40465.04
Organism:
Rattus norvegicus (rat)
Description:
Competition binding assays were using CHO-K1 cell membranes expressing the opioid receptor.
Residue:
372
  
Inhibitor
Name:
BDBM50123658
Synonyms:
3-[(R)-((2S,5R)-4-Allyl-2,5-dimethyl-piperazin-1-yl)-(3-hydroxy-phenyl)-methyl]-N-(3-fluoro-phenyl)-N-methyl-benzamide | CHEMBL155892
Type:
Small organic molecule
Emp. Form.:
C30H34FN3O2
Mol. Mass.:
487.6083
SMILES:
C[C@@H]1CN([C@@H](c2cccc(O)c2)c2cccc(c2)C(=O)N(C)c2cccc(F)c2)[C@@H](C)CN1CC=C
: