Target
Adenosine receptor A2a
Ligand
BDBM50125910
Substrate
Meas. Tech.
ChEMBL_31493 (CHEMBL649802)
Ki
3.1±n/a nM
Citation
 Baraldi, PGFruttarolo, FTabrizi, MAPreti, DRomagnoli, REl-Kashef, HMoorman, AVarani, KGessi, SMerighi, SBorea, PA Design, synthesis, and biological evaluation of C9- and C2-substituted pyrazolo[4,3-e]-1,2,4-triazolo[1,5-c]pyrimidines as new A2A and A3 adenosine receptors antagonists. J Med Chem 46:1229-41 (2003)  
Target
Name:
Adenosine receptor A2a
Synonyms:
A2A adenosine receptor (hA2A) ADENOSINE A2 ADORA2 Adenosine A2A receptor (A2AAR)
Type:
G Protein-Coupled Receptor (GPCR)
Mol. Mass.:
44716.46
Organism:
Homo sapiens (Human)
Description:
P29274
Residue:
412
  
Inhibitor
Name:
BDBM50125910
Synonyms:
1-(2-Furan-2-yl-8-methyl-9-methylsulfanyl-8H-pyrazolo[4,3-e][1,2,4]triazolo[1,5-c]pyrimidin-5-yl)-3-(4-methoxy-phenyl)-urea | CHEMBL22113
Type:
Small organic molecule
Emp. Form.:
C20H18N8O3S
Mol. Mass.:
450.474
SMILES:
COc1ccc(NC(=O)Nc2nc3nn(C)c(SC)c3c3nc(nn23)-c2ccco2)cc1
: