Target
Adenosine receptor A2a
Ligand
BDBM50125908
Substrate
Meas. Tech.
ChEMBL_31493 (CHEMBL649802)
Ki
10±n/a nM
Citation
 Baraldi, PGFruttarolo, FTabrizi, MAPreti, DRomagnoli, REl-Kashef, HMoorman, AVarani, KGessi, SMerighi, SBorea, PA Design, synthesis, and biological evaluation of C9- and C2-substituted pyrazolo[4,3-e]-1,2,4-triazolo[1,5-c]pyrimidines as new A2A and A3 adenosine receptors antagonists. J Med Chem 46:1229-41 (2003)  
Target
Name:
Adenosine receptor A2a
Synonyms:
A2A adenosine receptor (hA2A) ADENOSINE A2 ADORA2 Adenosine A2A receptor (A2AAR)
Type:
G Protein-Coupled Receptor (GPCR)
Mol. Mass.:
44716.46
Organism:
Homo sapiens (Human)
Description:
P29274
Residue:
412
  
Inhibitor
Name:
BDBM50125908
Synonyms:
CHEMBL20888 N*9*-Ethyl-2-furan-2-yl-8-methyl-8H-pyrazolo[4,3-e][1,2,4]triazolo[1,5-c]pyrimidine-5,9-diamine
Type:
Small organic molecule
Emp. Form.:
C13H14N8O
Mol. Mass.:
298.3033
SMILES:
CCNc1n(C)nc2nc(N)n3nc(nc3c12)-c1ccco1
: