Target
Cholinesterase
Ligand
BDBM50409820
Substrate
Meas. Tech.
ChEMBL_41569 (CHEMBL655132)
IC50
>50000±n/a nM
Citation
 Meier, CDucho, CGörbig, UEsnouf, RBalzarini, J Interaction of cycloSal-pronucleotides with cholinesterases from different origins. A structure-activity relationship. J Med Chem 47:2839-52 (2004)  
Target
Name:
Cholinesterase
Synonyms:
Acylcholine acylhydrolase Butyrylcholine esterase CHLE_MOUSE Pseudocholinesterase
Type:
Protein
Mol. Mass.:
68465.99
Organism:
Mus musculus (Mouse)
Description:
Q03311
Residue:
603
  
Inhibitor
Name:
BDBM50409820
Synonyms:
CHEMBL2114386
Type:
Small organic molecule
Emp. Form.:
C18H19N2O7P
Mol. Mass.:
406.3264
SMILES:
Cc1cccc2CO[P@](=O)(OC[C@H]3O[C@H](C=C3)n3cc(C)c(=O)[nH]c3=O)Oc12
: