Target
Cannabinoid receptor 1
Ligand
BDBM50147009
Substrate
Meas. Tech.
ChEMBL_46631 (CHEMBL658887)
Ki
855.6±n/a nM
Citation
 Jagerovic, NHernandez-Folgado, LAlkorta, IGoya, PNavarro, MSerrano, ARodriguez de Fonseca, FDannert, MTAlsasua, ASuardiaz, MPascual, DMartín, MI Discovery of 5-(4-chlorophenyl)-1-(2,4-dichlorophenyl)-3-hexyl-1h-1,2,4-triazole, a novel in vivo cannabinoid antagonist containing a 1,2,4-triazole motif. J Med Chem 47:2939-42 (2004)  
Target
Name:
Cannabinoid receptor 1
Synonyms:
Brain-type cannabinoid receptor CB-R CNR1_RAT Cannabinoid receptor Cnr1 | Skr6
Type:
G Protein-Coupled Receptor (GPCR)
Mol. Mass.:
52856.55
Organism:
Rattus norvegicus (rat)
Description:
P20272
Residue:
473
  
Inhibitor
Name:
BDBM50147009
Synonyms:
5-(4-Chloro-phenyl)-1-(2,4-dichloro-phenyl)-3-hexyl-1H-[1,2,4]triazole | CHEMBL328379
Type:
Small organic molecule
Emp. Form.:
C20H20Cl3N3
Mol. Mass.:
408.752
SMILES:
CCCCCCc1nc(-c2ccc(Cl)cc2)n(n1)-c1ccc(Cl)cc1Cl
: