Target
Glycogen phosphorylase, brain form
Ligand
BDBM34103
Substrate
Meas. Tech.
ChEMBL_70998 (CHEMBL680574)
Ki
7400000±n/a nM
Citation
 Pan, DLiu, JSenese, CHopfinger, AJTseng, Y Characterization of a ligand-receptor binding event using receptor-dependent four-dimensional quantitative structure-activity relationship analysis. J Med Chem 47:3075-88 (2004)  
Target
Name:
Glycogen phosphorylase, brain form
Synonyms:
Brain glycogen phosphorylase PYGB | PYGB_HUMAN
Type:
PROTEIN
Mol. Mass.:
96699.35
Organism:
Homo sapiens (Human)
Description:
ChEMBL_70998
Residue:
843
  
Inhibitor
Name:
BDBM34103
Synonyms:
D-glucose glucose
Type:
Emp. Form.:
C6H12O6
Mol. Mass.:
180.1559
SMILES:
OC[C@H]1OC(O)[C@H](O)[C@@H](O)[C@@H]1O
: