Target
Acetylcholinesterase
Ligand
BDBM50149204
Substrate
Meas. Tech.
ChEMBL_29228 (CHEMBL641394)
IC50
390±n/a nM
Citation
 Erlanson, DAMcDowell, RSO'Brien, T Fragment-based drug discovery. J Med Chem 47:3463-82 (2004)  
Target
Name:
Acetylcholinesterase
Synonyms:
ACES_RAT Acetylcholinesterase and butyrylcholinesterase (AChE and BChE) Acetylcholinesterase, AChE | Ache
Type:
Enzyme
Mol. Mass.:
68193.62
Organism:
Rattus norvegicus (rat)
Description:
P37136
Residue:
614
  
Inhibitor
Name:
BDBM50149204
Synonyms:
CHEMBL323618 | N-Phenyl-N'-(1,2,3,4-tetrahydro-acridin-9-yl)-heptane-1,7-diamine
Type:
Small organic molecule
Emp. Form.:
C26H33N3
Mol. Mass.:
387.5603
SMILES:
C(CCCNc1ccccc1)CCCNc1c2CCCCc2nc2ccccc12
: