Target
Stromelysin-1
Ligand
BDBM50149219
Substrate
Meas. Tech.
ChEMBL_104898 (CHEMBL715756)
IC50
15±n/a nM
Citation
 Erlanson, DAMcDowell, RSO'Brien, T Fragment-based drug discovery. J Med Chem 47:3463-82 (2004)  
Target
Name:
Stromelysin-1
Synonyms:
MMP-3 MMP3_HUMAN Matrix metalloproteinase 3 Matrix metalloproteinase-3 (MMP-3) SL-1 Stromelysin 1 | Transin-1
Type:
Enzyme
Mol. Mass.:
53973.13
Organism:
Homo sapiens (Human)
Description:
P08254
Residue:
477
  
Inhibitor
Name:
BDBM50149219
Synonyms:
3-(3'-Cyanomethyl-biphenyl-4-yloxy)-N-hydroxy-propionamide | CHEMBL116756
Type:
Small organic molecule
Emp. Form.:
C17H16N2O3
Mol. Mass.:
296.3205
SMILES:
ONC(=O)CCOc1ccc(cc1)-c1cccc(CC#N)c1
: