Target
Stromelysin-1
Ligand
BDBM50149230
Substrate
Meas. Tech.
ChEMBL_104898 (CHEMBL715756)
IC50
310±n/a nM
Citation
 Erlanson, DAMcDowell, RSO'Brien, T Fragment-based drug discovery. J Med Chem 47:3463-82 (2004)  
Target
Name:
Stromelysin-1
Synonyms:
MMP-3 MMP3_HUMAN Matrix metalloproteinase 3 Matrix metalloproteinase-3 (MMP-3) SL-1 Stromelysin 1 | Transin-1
Type:
Enzyme
Mol. Mass.:
53973.13
Organism:
Homo sapiens (Human)
Description:
P08254
Residue:
477
  
Inhibitor
Name:
BDBM50149230
Synonyms:
3-(Biphenyl-4-yloxy)-N-hydroxy-propionamide | CHEMBL118740
Type:
Small organic molecule
Emp. Form.:
C15H15NO3
Mol. Mass.:
257.2845
SMILES:
ONC(=O)CCOc1ccc(cc1)-c1ccccc1
: