Target
Stromelysin-1
Ligand
BDBM50149241
Substrate
Meas. Tech.
ChEMBL_104900 (CHEMBL713436)
Kd
20000±n/a nM
Citation
 Erlanson, DAMcDowell, RSO'Brien, T Fragment-based drug discovery. J Med Chem 47:3463-82 (2004)  
Target
Name:
Stromelysin-1
Synonyms:
MMP-3 MMP3_HUMAN Matrix metalloproteinase 3 Matrix metalloproteinase-3 (MMP-3) SL-1 Stromelysin 1 | Transin-1
Type:
Enzyme
Mol. Mass.:
53973.13
Organism:
Homo sapiens (Human)
Description:
P08254
Residue:
477
  
Inhibitor
Name:
BDBM50149241
Synonyms:
(4'-Hydroxy-biphenyl-3-yl)-acetonitrile | CHEMBL118512
Type:
Small organic molecule
Emp. Form.:
C14H11NO
Mol. Mass.:
209.2432
SMILES:
Oc1ccc(cc1)-c1cccc(CC#N)c1
: