Target
Tyrosine-protein phosphatase non-receptor type 1
Ligand
BDBM50133279
Substrate
Meas. Tech.
ChEMBL_162588 (CHEMBL768529)
Ki
148000±n/a nM
Citation
 Erlanson, DAMcDowell, RSO'Brien, T Fragment-based drug discovery. J Med Chem 47:3463-82 (2004)  
Target
Name:
Tyrosine-protein phosphatase non-receptor type 1
Synonyms:
PTN1_HUMAN PTPN1 Protein tyrosine phosphatase-1B (PTP1B) Protein-tyrosine phosphatase 1B (PTP1B) Tyrosine-protein phosphatase non-receptor type 1 (PTP1B)
Type:
Protein phosphatase
Mol. Mass.:
49963.76
Organism:
Homo sapiens (Human)
Description:
Human recombinant GST-fusion PTP1B (1-435).
Residue:
435
  
Inhibitor
Name:
BDBM50133279
Synonyms:
5-(3-Butyrylamino-phenyl)-isoxazole-3-carboxylic acid CHEMBL333158
Type:
Small organic molecule
Emp. Form.:
C14H14N2O4
Mol. Mass.:
274.272
SMILES:
CCCC(=O)Nc1cccc(c1)-c1cc(no1)C(O)=O
: