Target
Adenosine receptor A3
Ligand
BDBM50149355
Substrate
Meas. Tech.
ChEMBL_31395 (CHEMBL643653)
EC50
5.4±n/a nM
Citation
 Colotta, VCatarzi, DVarano, FCalabri, FRLenzi, OFilacchioni, GMartini, CTrincavelli, LDeflorian, FMoro, S 1,2,4-triazolo[4,3-a]quinoxalin-1-one moiety as an attractive scaffold to develop new potent and selective human A3 adenosine receptor antagonists: synthesis, pharmacological, and ligand-receptor modeling studies. J Med Chem 47:3580-90 (2004)  
Target
Name:
Adenosine receptor A3
Synonyms:
A3 adenosine receptor (hA3) ADORA3 | Adenosine A3 receptor (A3AR)
Type:
G Protein-Coupled Receptor (GPCR)
Mol. Mass.:
36197.32
Organism:
Homo sapiens (Human)
Description:
P0DMS8
Residue:
318
  
Inhibitor
Name:
BDBM50149355
Synonyms:
2-(4-Nitro-phenyl)-2H,5H-[1,2,4]triazolo[4,3-a]quinoxaline-1,4-dione | CHEMBL324095
Type:
Small organic molecule
Emp. Form.:
C15H9N5O4
Mol. Mass.:
323.2631
SMILES:
[O-][N+](=O)c1ccc(cc1)-n1nc2n(c3ccccc3[nH]c2=O)c1=O
: