Target
RNA-directed RNA polymerase
Ligand
BDBM50144936
Substrate
Meas. Tech.
ChEMBL_84043 (CHEMBL691889)
IC50
50000±n/a nM
Citation
 Eldrup, ABAllerson, CRBennett, CFBera, SBhat, BBhat, NBosserman, MRBrooks, JBurlein, CCarroll, SSCook, PDGetty, KLMacCoss, MMcMasters, DROlsen, DBPrakash, TPPrhavc, MSong, QTomassini, JEXia, J Structure-activity relationship of purine ribonucleosides for inhibition of hepatitis C virus RNA-dependent RNA polymerase. J Med Chem 47:2283-95 (2004)  
Target
Name:
RNA-directed RNA polymerase
Synonyms:
Hepatitis C virus NS5B RNA-dependent RNA polymerase | NS5B protein
Type:
Protein
Mol. Mass.:
25173.95
Organism:
Hepatitis C virus
Description:
Q8JXU8
Residue:
229
  
Inhibitor
Name:
BDBM50144936
Synonyms:
CHEMBL1090 adenine arabinoside
Type:
Small organic molecule
Emp. Form.:
C10H13N5O4
Mol. Mass.:
267.2413
SMILES:
Nc1ncnc2n(cnc12)[C@@H]1O[C@H](CO)[C@@H](O)[C@@H]1O
: