Target
Prothrombin
Ligand
BDBM50147799
Substrate
Meas. Tech.
ChEMBL_208532 (CHEMBL813626)
Ki
0.33±n/a nM
Citation
 Young, MBBarrow, JCGlass, KLLundell, GFNewton, CLPellicore, JMRittle, KESelnick, HGStauffer, KJVacca, JPWilliams, PDBohn, DClayton, FCCook, JJKrueger, JAKuo, LCLewis, SDLucas, BJMcMasters, DRMiller-Stein, CPietrak, BLWallace, AAWhite, RBWong, BYan, YNantermet, PG Discovery and evaluation of potent P1 aryl heterocycle-based thrombin inhibitors. J Med Chem 47:2995-3008 (2004)  
Target
Name:
Prothrombin
Synonyms:
Activation peptide fragment 1 Coagulation factor II Prothrombin precursor Thrombin heavy chain | Thrombin light chain
Type:
Protein
Mol. Mass.:
70029.57
Organism:
Homo sapiens (Human)
Description:
P00734
Residue:
622
  
Inhibitor
Name:
BDBM50147799
Synonyms:
2-[(S)-1-((R)-2-Amino-3-phenyl-propionyl)-pyrrolidin-2-yl]-N-(5-chloro-2-tetrazol-1-yl-benzyl)-acetamide | CHEMBL102978
Type:
Small organic molecule
Emp. Form.:
C23H26ClN7O2
Mol. Mass.:
467.951
SMILES:
N[C@H](Cc1ccccc1)C(=O)N1CCC[C@H]1CC(=O)NCc1cc(Cl)ccc1-n1cnnn1
: