Target
Genome polyprotein/Non-structural protein 4A
Ligand
BDBM50150992
Substrate
Meas. Tech.
ChEMBL_303666 (CHEMBL830427)
Ki
100.0±n/a nM
Citation
 Malancona, SColarusso, SOntoria, JMMarchetti, APoma, MStansfield, ILaufer, RDi Marco, ATaliani, MVerdirame, MGonzalez-Paz, OMatassa, VGNarjes, F SAR and pharmacokinetic studies on phenethylamide inhibitors of the hepatitis C virus NS3/NS4A serine protease. Bioorg Med Chem Lett 14:4575-9 (2004)  
Target
Name:
Genome polyprotein/Non-structural protein 4A
Synonyms:
Hepatitis C virus serine protease, NS3/NS4A
Type:
Mol. Mass.:
Description:
ASSAY_ID of ChEMBL is 1969955
Components:
This complex has 2 components.
Component 1
Name:
Non-structural protein 4A
Synonyms:
Hepatitis C virus NS4A protein Non-structural protein 4A
Type:
PROTEIN
Mol. Mass.:
5762.65
Organism:
Hepatitis C virus
Description:
ChEMBL_305334
Residue:
54
  
Component 2
Name:
Genome polyprotein
Synonyms:
Hepatitis C virus NS3 protease/helicase | Hepatitis C virus serine protease, NS3/NS4A
Type:
Protein
Mol. Mass.:
67067.41
Organism:
Hepatitis C virus
Description:
A3EZI9
Residue:
631
  
Inhibitor
Name:
BDBM50150992
Synonyms:
CHEMBL366279 | {(S)-1-[(2S,4S)-4-Cyclohexyl-2-((S)-1-{2-[2,6-difluoro-4-(2H-tetrazol-5-yl)-phenyl]-ethylcarbamoyl}-3,3-difluoro-propylcarbamoyl)-pyrrolidine-1-carbonyl]-2-methyl-propyl}-carbamic acid isobutyl ester
Type:
Small organic molecule
Emp. Form.:
C34H48F4N8O5
Mol. Mass.:
724.7891
SMILES:
CC(C)COC(=O)N[C@@H](C(C)C)C(=O)N1C[C@@H](C[C@H]1C(=O)N[C@@H](CC(F)F)C(=O)NCCc1c(F)cc(cc1F)-c1nnn[nH]1)C1CCCCC1
: