Target
Beta-secretase 1
Ligand
BDBM50128039
Substrate
Meas. Tech.
ChEMBL_302490 (CHEMBL827180)
Ki
5808±n/a nM
Citation
 Rajamani, RReynolds, CH Modeling the binding affinities of beta-secretase inhibitors: application to subsite specificity. Bioorg Med Chem Lett 14:4843-6 (2004)  
Target
Name:
Beta-secretase 1
Synonyms:
ASP2 Aspartyl protease 2 BACE1 Beta-secretase (BACE) Beta-secretase 1 (BACE 1) Beta-secretase 1 (BACE1) Beta-site amyloid precursor protein cleaving enzyme 1 Memapsin-2 beta-Secretase (BACE-1) | beta-Secretase (BACE1)
Type:
Protein
Mol. Mass.:
55755.10
Organism:
Homo sapiens (Human)
Description:
P56817
Residue:
501
  
Inhibitor
Name:
BDBM50128039
Synonyms:
CHEMBL66595 {1-[4-(1-Benzylcarbamoyl-2-methyl-propylcarbamoyl)-2-hydroxy-1-isobutyl-pentylcarbamoyl]-3-methylsulfanyl-propyl}-carbamic acid tert-butyl ester
Type:
Small organic molecule
Emp. Form.:
C32H54N4O6S
Mol. Mass.:
622.859
SMILES:
CSCCC(NC(=O)OC(C)(C)C)C(=O)N[C@@H](CC(C)C)C(O)CC(C)C(=O)NC(C(C)C)C(=O)NCc1ccccc1
: