Target
Beta-secretase 1
Ligand
BDBM16763
Substrate
Meas. Tech.
ChEMBL_304885 (CHEMBL829260)
IC50
6600±n/a nM
Citation
 Rajamani, RReynolds, CH Modeling the binding affinities of beta-secretase inhibitors: application to subsite specificity. Bioorg Med Chem Lett 14:4843-6 (2004)  
Target
Name:
Beta-secretase 1
Synonyms:
ASP2 Aspartyl protease 2 BACE1 Beta-secretase (BACE) Beta-secretase 1 (BACE 1) Beta-secretase 1 (BACE1) Beta-site amyloid precursor protein cleaving enzyme 1 Memapsin-2 beta-Secretase (BACE-1) | beta-Secretase (BACE1)
Type:
Protein
Mol. Mass.:
55755.10
Organism:
Homo sapiens (Human)
Description:
P56817
Residue:
501
  
Inhibitor
Name:
BDBM16763
Synonyms:
3-N-[(2S,3S,5R)-1-(3,5-difluorophenyl)-5-{[(1R,3R,5S)-3,5-dimethoxycyclohexyl]carbamoyl}-5-ethyl-3-hydroxypentan-2-yl]-1-N,1-N-dipropylbenzene-1,3-dicarboxamide Hydroxyethylene-Based Peptidomimetic Inhibitor, 13
Type:
Small organic molecule
Emp. Form.:
C36H51F2N3O6
Mol. Mass.:
659.8034
SMILES:
CCCN(CCC)C(=O)c1cccc(c1)C(=O)N[C@@H](Cc1cc(F)cc(F)c1)[C@@H](O)C[C@@H](CC)C(=O)N[C@@H]1C[C@@H](C[C@@H](C1)OC)OC
: