Target
Sphingosine 1-phosphate receptor 5
Ligand
BDBM50152329
Substrate
Meas. Tech.
ChEMBL_306057 (CHEMBL833013)
IC50
2.2±n/a nM
Citation
 Yan, LHale, JJLynch, CLBudhu, RGentry, AMills, SGHajdu, RKeohane, CARosenbach, MJMilligan, JAShei, GJChrebet, GBergstrom, JCard, DRosen, HMandala, SM Design and synthesis of conformationally constrained 3-(N-alkylamino)propylphosphonic acids as potent agonists of sphingosine-1-phosphate (S1P) receptors. Bioorg Med Chem Lett 14:4861-6 (2004)  
Target
Name:
Sphingosine 1-phosphate receptor 5
Synonyms:
EDG8 S1P5 S1PR5_HUMAN Sphingosine 1-phosphate receptor Edg-8
Type:
G Protein-Coupled Receptor (GPCR)
Mol. Mass.:
41796.42
Organism:
Homo sapiens (Human)
Description:
Residue:
398
  
Inhibitor
Name:
BDBM50152329
Synonyms:
1-(4-nonylbenzyl)pyrrolidin-3-ylphosphonic acid [1-(4-Nonyl-benzyl)-pyrrolidin-3-yl]-phosphonic acid
Type:
Small organic molecule
Emp. Form.:
C20H34NO3P
Mol. Mass.:
367.4626
SMILES:
CCCCCCCCCc1ccc(CN2CCC(C2)P(O)(O)=O)cc1
: