Target
1-deoxy-D-xylulose 5-phosphate reductoisomerase
Ligand
BDBM50153714
Substrate
Meas. Tech.
ChEMBL_303122 (CHEMBL829631)
Ki
800000±n/a nM
Citation
 Phaosiri, CProteau, PJ Substrate analogs for the investigation of deoxyxylulose 5-phosphate reductoisomerase inhibition: synthesis and evaluation. Bioorg Med Chem Lett 14:5309-12 (2004)  
Target
Name:
1-deoxy-D-xylulose 5-phosphate reductoisomerase
Synonyms:
1-Deoxy-D-xylulose 5-phosphate reductoisomerase (DXP) 1-deoxy-D-xylulose 5-phosphate reductoisomerase (DXR) DXP reductoisomerase dxr yaeM
Type:
Protein
Mol. Mass.:
43384.52
Organism:
Escherichia coli
Description:
P45568
Residue:
398
  
Inhibitor
Name:
BDBM50153714
Synonyms:
4S-hydroxypentan-2-one 5-phosphate
Type:
Small organic molecule
Emp. Form.:
C5H9O6P
Mol. Mass.:
196.0962
SMILES:
CC(=O)C[C@H](O)COP([O-])([O-])=O
: