Target
Carbonic anhydrase 9
Ligand
BDBM50153970
Substrate
Meas. Tech.
ChEMBL_302882 (CHEMBL828796)
Ki
0.12±n/a nM
Citation
 Garaj, VPuccetti, LFasolis, GWinum, JYMontero, JLScozzafava, AVullo, DInnocenti, ASupuran, CT Carbonic anhydrase inhibitors: synthesis and inhibition of cytosolic/tumor-associated carbonic anhydrase isozymes I, II, and IX with sulfonamides incorporating 1,2,4-triazine moieties. Bioorg Med Chem Lett 14:5427-33 (2004)  
Target
Name:
Carbonic anhydrase 9
Synonyms:
CA-IX CAH9_HUMAN Carbonic anhydrase 9 (CA IX) Carbonic anhydrase 9 precursor Carbonic anhydrase IX (CAIX) Carbonic anhydrases; II & IX MN RCC-associated antigen G250
Type:
Enzyme
Mol. Mass.:
49669.03
Organism:
Homo sapiens (Human)
Description:
Catalytic domain of human cloned isozyme was used in the assay
Residue:
459
  
Inhibitor
Name:
BDBM50153970
Synonyms:
4-(4,6-Diethoxy-[1,3,5]triazin-2-ylamino)-benzenesulfonamide | CHEMBL363543
Type:
Small organic molecule
Emp. Form.:
C13H17N5O4S
Mol. Mass.:
339.37
SMILES:
CCOc1nc(Nc2ccc(cc2)S(N)(=O)=O)nc(OCC)n1
: