Target
Integrin alpha-IIb/beta-3
Ligand
BDBM50155251
Substrate
Meas. Tech.
ChEMBL_303801 (CHEMBL829850)
Ki
7.10±n/a nM
Citation
 Krysko, AAChugunov, BMMalovichko, OLAndronati, SAKabanova, TAKaraseva, TLKiriyak, AV Novel fibrinogen receptor antagonists. RGDF mimetics, derivatives of 4-(isoindoline-5-yl)amino-4-oxobutyric acid. Bioorg Med Chem Lett 14:5533-5 (2004)  
Target
Name:
Integrin alpha-IIb/beta-3
Synonyms:
Glycoprotein IIb/IIIa
Type:
Mol. Mass.:
Description:
ASSAY_ID of EBI is 30109
Components:
This complex has 2 components.
Component 1
Name:
Integrin beta-3
Synonyms:
CD_antigen=CD61 GPIIIa ITGB3 Platelet membrane glycoprotein IIIa
Type:
Protein
Mol. Mass.:
87038.91
Organism:
Homo sapiens (Human)
Description:
P05106
Residue:
788
  
Component 2
Name:
Integrin alpha-IIb
Synonyms:
CD_antigen=CD41 GPIIb Glycoprotein IIb ITGA2B Integrin alpha-IIb heavy chain Integrin alpha-IIb light chain, form 2 Integrin alpha-V/beta-3 and alpha-IIb/beta 3 | Platelet membrane glycoprotein IIb
Type:
Protein
Mol. Mass.:
113354.85
Organism:
Homo sapiens (Human)
Description:
P08514
Residue:
1039
  
Inhibitor
Name:
BDBM50155251
Synonyms:
3-[3-(2,3-Dihydro-1H-isoindol-5-ylcarbamoyl)-propionylamino]-propionic acid; hydrochloride | CHEMBL537409
Type:
Small organic molecule
Emp. Form.:
C15H19N3O4
Mol. Mass.:
305.3291
SMILES:
OC(=O)CCNC(=O)CCC(=O)Nc1ccc2CNCc2c1
: