Target
D(4) dopamine receptor
Ligand
BDBM50155516
Substrate
Meas. Tech.
ChEBML_302618
Ki
1015±n/a nM
Citation
 Sikazwe, DMLi, SMardenborough, LCody, VRoth, BLAblordeppey, SY Haloperidol: towards further understanding of the structural contributions of its pharmacophoric elements at D2-like receptors. Bioorg Med Chem Lett 14:5739-42 (2004)  
Target
Name:
D(4) dopamine receptor
Synonyms:
D(2C) dopamine receptor DOPAMINE D4.2 DRD4 Dopamine D4 receptor
Type:
Enzyme
Mol. Mass.:
48373.19
Organism:
Homo sapiens (Human)
Description:
P21917
Residue:
419
  
Inhibitor
Name:
BDBM50155516
Synonyms:
3-(4-Chloro-phenyl)-8-(4-fluoro-benzyl)-8-aza-bicyclo[3.2.1]octan-3-ol; hydrochloride | CHEMBL537183
Type:
Small organic molecule
Emp. Form.:
C20H21ClFNO
Mol. Mass.:
345.838
SMILES:
OC1(CC2CCC(C1)N2Cc1ccc(F)cc1)c1ccc(Cl)cc1
: