Target
Prostacyclin receptor
Ligand
BDBM50167890
Substrate
Meas. Tech.
ChEMBL_302783 (CHEMBL839468)
Ki
12±n/a nM
Citation
 Hattori, KOkitsu, OTabuchi, STaniguchi, KNishio, MKoyama, SSeki, JSakane, K Discovery of new diphenyloxazole derivatives containing a pyrrolidine ring: orally active prostacyclin mimetics. Part 2. Bioorg Med Chem Lett 15:3279-83 (2005)  
Target
Name:
Prostacyclin receptor
Synonyms:
PGI receptor PRIPR Prostacyclin (IP) Receptor Prostaglandin I Prostaglandin I2 receptor | Prostanoid IP receptor
Type:
G Protein-Coupled Receptor (GPCR)
Mol. Mass.:
40968.22
Organism:
Homo sapiens (Human)
Description:
The membranes prepared from human platelet were used in binding assay.
Residue:
386
  
Inhibitor
Name:
BDBM50167890
Synonyms:
CHEMBL190497 Sodium; {(R)-5-[(R)-2-(4,5-diphenyl-oxazol-2-yl)-pyrrolidin-1-yl]-5,6,7,8-tetrahydro-naphthalen-1-yloxy}-acetate
Type:
Small organic molecule
Emp. Form.:
C31H29N2O4
Mol. Mass.:
493.5735
SMILES:
[O-]C(=O)COc1cccc2[C@@H](CCCc12)N1CCC[C@@H]1c1nc(c(o1)-c1ccccc1)-c1ccccc1
: