Target
Carbonic anhydrase 14
Ligand
BDBM10886
Substrate
Meas. Tech.
ChEMBL_303797 (CHEMBL829846)
Ki
33±n/a nM
Citation
 Nishimori, IVullo, DInnocenti, AScozzafava, AMastrolorenzo, ASupuran, CT Carbonic anhydrase inhibitors: inhibition of the transmembrane isozyme XIV with sulfonamides. Bioorg Med Chem Lett 15:3828-33 (2005)  
Target
Name:
Carbonic anhydrase 14
Synonyms:
CA-XIV CAH14_HUMAN Carbonic Anhydrase XIV Carbonic anhydrase 14 Carbonic anhydrase XIV (CA XIV)
Type:
Enzyme
Mol. Mass.:
37665.67
Organism:
Homo sapiens (Human)
Description:
Human (cloned) isozyme.
Residue:
337
  
Inhibitor
Name:
BDBM10886
Synonyms:
2-N-benzene-1,3,4-thiadiazole-2,5-disulfonamide Benzolamide CHEMBL73962
Type:
Small organic molecule
Emp. Form.:
C8H8N4O4S3
Mol. Mass.:
320.369
SMILES:
NS(=O)(=O)c1nnc(NS(=O)(=O)c2ccccc2)s1
: