Target
Carboxylic ester hydrolase
Ligand
BDBM50169860
Substrate
Meas. Tech.
ChEMBL_305980 (CHEMBL832145)
IC50
1370000±n/a nM
Citation
 Sheng, RLin, XLi, JJiang, YShang, ZHu, Y Design, synthesis, and evaluation of 2-phenoxy-indan-1-one derivatives as acetylcholinesterase inhibitors. Bioorg Med Chem Lett 15:3834-7 (2005)  
Target
Name:
Carboxylic ester hydrolase
Synonyms:
Acetylcholinesterase and butyrylcholinesterase (AChE and BChE) Butyrylcholinesterase (BuChE) | butyrylcholinesterase precursor
Type:
Enzyme
Mol. Mass.:
67776.22
Organism:
Rattus norvegicus (rat)
Description:
Residue:
597
  
Inhibitor
Name:
BDBM50169860
Synonyms:
2-[4-(1-Dimethylamino-ethyl)-phenoxy]-5,6-dimethoxy-indan-1-one | CHEMBL178152
Type:
Small organic molecule
Emp. Form.:
C21H25NO4
Mol. Mass.:
355.4275
SMILES:
COc1cc2CC(Oc3ccc(cc3)C(C)N(C)C)C(=O)c2cc1OC
: