Target
Carboxylic ester hydrolase
Ligand
BDBM50169868
Substrate
Meas. Tech.
ChEMBL_305980 (CHEMBL832145)
IC50
39500±n/a nM
Citation
 Sheng, RLin, XLi, JJiang, YShang, ZHu, Y Design, synthesis, and evaluation of 2-phenoxy-indan-1-one derivatives as acetylcholinesterase inhibitors. Bioorg Med Chem Lett 15:3834-7 (2005)  
Target
Name:
Carboxylic ester hydrolase
Synonyms:
Acetylcholinesterase and butyrylcholinesterase (AChE and BChE) Butyrylcholinesterase (BuChE) | butyrylcholinesterase precursor
Type:
Enzyme
Mol. Mass.:
67776.22
Organism:
Rattus norvegicus (rat)
Description:
Residue:
597
  
Inhibitor
Name:
BDBM50169868
Synonyms:
5,6-Dimethoxy-2-(3-pyrrolidin-1-ylmethyl-phenoxy)-indan-1-one | CHEMBL362583
Type:
Small organic molecule
Emp. Form.:
C22H25NO4
Mol. Mass.:
367.4382
SMILES:
COc1cc2CC(Oc3cccc(CN4CCCC4)c3)C(=O)c2cc1OC
: