Target
Carboxylic ester hydrolase
Ligand
BDBM50169872
Substrate
Meas. Tech.
ChEMBL_305980 (CHEMBL832145)
IC50
55500±n/a nM
Citation
 Sheng, RLin, XLi, JJiang, YShang, ZHu, Y Design, synthesis, and evaluation of 2-phenoxy-indan-1-one derivatives as acetylcholinesterase inhibitors. Bioorg Med Chem Lett 15:3834-7 (2005)  
Target
Name:
Carboxylic ester hydrolase
Synonyms:
Acetylcholinesterase and butyrylcholinesterase (AChE and BChE) Butyrylcholinesterase (BuChE) | butyrylcholinesterase precursor
Type:
Enzyme
Mol. Mass.:
67776.22
Organism:
Rattus norvegicus (rat)
Description:
Residue:
597
  
Inhibitor
Name:
BDBM50169872
Synonyms:
5,6-Dimethoxy-2-(3-piperidin-1-ylmethyl-phenoxy)-indan-1-one | CHEMBL181216
Type:
Small organic molecule
Emp. Form.:
C23H27NO4
Mol. Mass.:
381.4648
SMILES:
COc1cc2CC(Oc3cccc(CN4CCCCC4)c3)C(=O)c2cc1OC
: