Target
Carbonic anhydrase 1
Ligand
BDBM50128219
Substrate
Meas. Tech.
ChEMBL_302714 (CHEMBL839585)
Ki
105±n/a nM
Citation
 Winum, JYPastorekova, SJakubickova, LMontero, JLScozzafava, APastorek, JVullo, DInnocenti, ASupuran, CT Carbonic anhydrase inhibitors: synthesis and inhibition of cytosolic/tumor-associated carbonic anhydrase isozymes I, II, and IX with bis-sulfamates. Bioorg Med Chem Lett 15:579-84 (2005)  
Target
Name:
Carbonic anhydrase 1
Synonyms:
CA-I CAB Carbonate dehydratase I Carbonic anhydrase 1 (CA I) Carbonic anhydrase 1 (Recombinant CA I) Carbonic anhydrase B Carbonic anhydrase I (CA I) Carbonic anhydrase I (CAI) Carbonic anhydrase isoenzyme I (hCA I) | hCA
Type:
Enzyme
Mol. Mass.:
28873.37
Organism:
Homo sapiens (Human)
Description:
P00915
Residue:
261
  
Inhibitor
Name:
BDBM50128219
Synonyms:
CHEMBL68257 | Sulfamic acid 3-pentyl-5-sulfamoyloxy-phenyl ester
Type:
Small organic molecule
Emp. Form.:
C11H18N2O6S2
Mol. Mass.:
338.4
SMILES:
CCCCCc1cc(OS(N)(=O)=O)cc(OS(N)(=O)=O)c1
: