Target
Carbonic anhydrase 9
Ligand
BDBM50154471
Substrate
Meas. Tech.
ChEMBL_303142 (CHEMBL829116)
Ki
10.1±n/a nM
Citation
 Winum, JYPastorekova, SJakubickova, LMontero, JLScozzafava, APastorek, JVullo, DInnocenti, ASupuran, CT Carbonic anhydrase inhibitors: synthesis and inhibition of cytosolic/tumor-associated carbonic anhydrase isozymes I, II, and IX with bis-sulfamates. Bioorg Med Chem Lett 15:579-84 (2005)  
Target
Name:
Carbonic anhydrase 9
Synonyms:
CA-IX CAH9_HUMAN Carbonic anhydrase 9 (CA IX) Carbonic anhydrase 9 precursor Carbonic anhydrase IX (CAIX) Carbonic anhydrases; II & IX MN RCC-associated antigen G250
Type:
Enzyme
Mol. Mass.:
49669.03
Organism:
Homo sapiens (Human)
Description:
Catalytic domain of human cloned isozyme was used in the assay
Residue:
459
  
Inhibitor
Name:
BDBM50154471
Synonyms:
CHEMBL182440 | Sulfamic acid 7-sulfamoyloxy-heptyl ester
Type:
Small organic molecule
Emp. Form.:
C7H18N2O6S2
Mol. Mass.:
290.358
SMILES:
NS(=O)(=O)OCCCCCCCOS(N)(=O)=O
: