Target
Carbonic anhydrase 1
Ligand
BDBM50159808
Substrate
Meas. Tech.
ChEMBL_302714 (CHEMBL839585)
Ki
79±n/a nM
Citation
 Winum, JYPastorekova, SJakubickova, LMontero, JLScozzafava, APastorek, JVullo, DInnocenti, ASupuran, CT Carbonic anhydrase inhibitors: synthesis and inhibition of cytosolic/tumor-associated carbonic anhydrase isozymes I, II, and IX with bis-sulfamates. Bioorg Med Chem Lett 15:579-84 (2005)  
Target
Name:
Carbonic anhydrase 1
Synonyms:
CA-I CAB Carbonate dehydratase I Carbonic anhydrase 1 (CA I) Carbonic anhydrase 1 (Recombinant CA I) Carbonic anhydrase B Carbonic anhydrase I (CA I) Carbonic anhydrase I (CAI) Carbonic anhydrase isoenzyme I (hCA I) | hCA
Type:
Enzyme
Mol. Mass.:
28873.37
Organism:
Homo sapiens (Human)
Description:
P00915
Residue:
261
  
Inhibitor
Name:
BDBM50159808
Synonyms:
CHEMBL182429 | Sulfamic acid 3-sulfamoyloxy-phenyl ester
Type:
Small organic molecule
Emp. Form.:
C6H8N2O6S2
Mol. Mass.:
268.268
SMILES:
NS(=O)(=O)Oc1cccc(OS(N)(=O)=O)c1
: