Target
Carbonic anhydrase 2
Ligand
BDBM50159812
Substrate
Meas. Tech.
ChEMBL_302729 (CHEMBL838677)
Ki
417±n/a nM
Citation
 Winum, JYPastorekova, SJakubickova, LMontero, JLScozzafava, APastorek, JVullo, DInnocenti, ASupuran, CT Carbonic anhydrase inhibitors: synthesis and inhibition of cytosolic/tumor-associated carbonic anhydrase isozymes I, II, and IX with bis-sulfamates. Bioorg Med Chem Lett 15:579-84 (2005)  
Target
Name:
Carbonic anhydrase 2
Synonyms:
CA-II CAC Carbonate dehydratase II Carbonic anhydrase 2 (CA-II) Carbonic anhydrase C Carbonic anhydrase II (CA-II) Carbonic anhydrase II (hCA II) | Carbonic anhydrase isoenzyme II (hCA II)
Type:
Enzyme
Mol. Mass.:
29250.71
Organism:
Homo sapiens (Human)
Description:
P00918
Residue:
260
  
Inhibitor
Name:
BDBM50159812
Synonyms:
CHEMBL170139 | Sulfamic acid 1-methyl-2-sulfamoyloxy-propyl ester
Type:
Small organic molecule
Emp. Form.:
C4H12N2O6S2
Mol. Mass.:
248.278
SMILES:
CC(OS(N)(=O)=O)C(C)OS(N)(=O)=O
: